hymnalTitle,displayTitle,firstLine,textAuthNumber,hymnalID,number,textTitle,refrainFirstLine,authors,composers,meter,tuneTitle,tuneAuthNumber,incipit,languages,textSources,tuneSources
"Beulah Songs: a choice collection of popular hymns and music, new and old. Especially adapted to camp meetings, prayer and conference meetings, family worship, and all other assemblies...","The Valley of Blessing","I have entered the valley of blessing so sweet",i_have_entered_the_valley_of_blessing_so,BS1879,73,"The Valley of Blessing","Oh come to this valley of blessing so sweet","Mrs. Annie Wittenmeyer","Wm. G. Fischer",,"[I have entered the valley of blessing so sweet]",i_have_entered_the_valley_fischer,513212165121135,English,,
"Bright Jewels for the Sunday School: a new collection of Sunday School songs written expressly for this work, many of which are the latest compositions of William B. Bradbury...","Oh, come to this valley of blessing so sweet","I have entered the valley of blessing so sweet",i_have_entered_the_valley_of_blessing_so,BJSS1869,54,,"Oh, come to this valley of blessing so sweet","Annie Wittemeyer",,,,,,English,,
"Calvary Songs","The Valley of Blessing","I have entered the valley of blessing so sweet",i_have_entered_the_valley_of_blessing_so,CS1875,40,"The Valley of Blessing","O come to this valley of blessing so sweet","Mrs. Annie Wittenmyer","Wm. G. Fischer",,"[I have entered the valley of blessing so sweet]",i_have_entered_the_valley_fischer,513212165121135,English,,
"Calvary Songs for Sunday School & Families. Words ed.","O come to this valley of blessing so sweet","I have entered the valley of blessing so sweet",i_have_entered_the_valley_of_blessing_so,CSSS1883,d61,,"O come to this valley of blessing so sweet","Annie Wittenmeyer",,,,,,English,,
"Chapel Treasures (Christ Chapel Sabbath-School, Lebanon, PA)","Oh, come to this valley of blessing so sweet","I have entered the valley of blessing so sweet",i_have_entered_the_valley_of_blessing_so,CTCC1873,166,,"Oh, come to this valley of blessing so sweet",,,,,,,English,"""The Casket"" p. 10",
"Choral Song","O come to this valley of blessing so sweet","I have entered the valley of blessing so sweet",i_have_entered_the_valley_of_blessing_so,CS1891,d82,,"O come to this valley of blessing so sweet","Annie Wittenmeyer",,,,,,,,
"Christ in Song: for all religious services nearly one thousand best gospel hymns, new and old with responsive scripture readings (Rev. and Enl.)","The Valley of Blessing","I have entered the valley of blessing so sweet",i_have_entered_the_valley_of_blessing_so,CSR1908,292,"The Valley of Blessing","O, come to this valley of blessing so sweet","Annie Wittenmeyer","Wm. G. Fischer",,"[I have entered the valley of blessing so sweet]",i_have_entered_the_valley_fischer,513212165121135,English,,
"Crown of Beauty","The Valley of Blessing","I have entered the valley of blessing so sweet",i_have_entered_the_valley_of_blessing_so,CB1902,160,"The Valley of Blessing","O, come to this valley of blessing so sweet","Annie Wittenmeyer","Wm. G. Fischer",,"[I have entered the valley of blessing so sweet]",i_have_entered_the_valley_fischer,513212165121135,English,,
"Crystal Gems for the Sabbath School: containing a choice collection of new hymns and tunes, suitable for anniversaries, and all other exercises of the Sabbath-school...","Oh, come to this valley of blessing so sweet","I have entered the valley of blessing so sweet",i_have_entered_the_valley_of_blessing_so,CGSS1875,66,,"Oh, come to this valley of blessing so sweet",,,,,,,English,,
"Dew Drops of Sacred Song: gathered for the use of Sabbath schools","O come to this valley of blessing so sweet","I have entered the valley of blessing so sweet",i_have_entered_the_valley_of_blessing_so,DDSS1870,27,,"O come to this valley of blessing so sweet","Annie Wittenmeyer",,,,,,English,,
"Die Deutsche Ausgabe der Englischen und Deutschen Frohen Botschaftslieder: zum Gebrauch bei Erweckungs- und Gebetsversammlungen (Ebenezer Hymnal)","Oh, come to this valley of blessing so sweet","I have entered the valley of blessing so sweet",i_have_entered_the_valley_of_blessing_so,DAED1887,e64,,"Oh, come to this valley of blessing so sweet","Annie Wittenmeyer",,,,,,English,,
"English and German Gospel Songs, or The Ebenezer Hymnal","O come to this valley of blessing so sweet","I have entered the valley of blessing so sweet",i_have_entered_the_valley_of_blessing_so,EGGS1887,d110,,"O come to this valley of blessing so sweet","Annie Wittenmeyer",,,,,,English,,
"Faith Hymns","O come to this valley of blessing so sweet","I have entered the valley of blessing so sweet",i_have_entered_the_valley_of_blessing_so,FH1870,d49,,"O come to this valley of blessing so sweet","Annie Wittenmeyer",,,,,,English,,
"Faith Hymns (New ed.)","Valley of Blessing","I have entered the valley of blessing so sweet",i_have_entered_the_valley_of_blessing_so,FHN1887,185,"Valley of Blessing","Oh come to this valley of blessing so sweet","Mrs. Annie Wittenmeyer","W. G. Fischer",,"[I have entered the valley of blessing so sweet]",i_have_entered_the_valley_fischer,513212165121135,English,,
"Favorite Gospel Songs","O come to this valley of blessing so sweet","I have entered the valley of blessing so sweet",i_have_entered_the_valley_of_blessing_so,FGS1894,185,,"O come to this valley of blessing so sweet",,,,,,,English,,
"Full Salvation Hymnal","O come to this valley of blessing so sweet","I have entered the valley of blessing so sweet",i_have_entered_the_valley_of_blessing_so,FSH1877,d51,,"O come to this valley of blessing so sweet","Annie Wittenmeyer",,,,,,English,,
"Gems of Music","O come to this valley of blessing so sweet","I have entered the valley of blessing so sweet",i_have_entered_the_valley_of_blessing_so,GoM1872,d15,,"O come to this valley of blessing so sweet","Annie Wittenmeyer",,,,,,English,,
"Gems of Praise and Joyful Songs Combined","O come to this valley of blessing so sweet","I have entered the valley of blessing so sweet",i_have_entered_the_valley_of_blessing_so,GPJS1904,d11,,"O come to this valley of blessing so sweet","Annie Wittenmeyer",,,,,,English,,
"Glad Hallelujahs: replete with sacred songs","The Valley of Blessing","I have entered the valley of blessing so sweet",i_have_entered_the_valley_of_blessing_so,GH1887,54,"The Valley of Blessing","Oh, come to this valley of blessing so sweet","Mrs. Annie Wittenmeyer","Wm. G. Fischer",,"[I have entered the valley of blessing so sweet]",i_have_entered_the_valley_fischer,513212165121135,English,,
"Glorious Gospel Hymns","O come to this valley of blessing so sweet","I have entered the valley of blessing so sweet",i_have_entered_the_valley_of_blessing_so,GGH1931,d199,,"O come to this valley of blessing so sweet","Annie Wittenmeyer",,,,,,English,,
"Goodly Pearls for the Sunday School","O come to this valley of blessing so sweet","I have entered the valley of blessing so sweet",i_have_entered_the_valley_of_blessing_so,GPSS1875,d50,,"O come to this valley of blessing so sweet","Annie Wittenmeyer",,,,,,English,,
"Gospel Hymns No. 2: as used by them in gospel meetings","The Valley of Blessing","I have entered the valley of blessing so sweet",i_have_entered_the_valley_of_blessing_so,GH21876,72,"The Valley of Blessing","O come to this valley of blessing so sweet","Mrs. Annie Wittenmeyer","Wm. G. Fischer",,"[I have entered the valley of blessing so sweet]",i_have_entered_the_valley_fischer,513212165121135,English,,
"Gospel Hymns Nos. 1 to 6","The Valley of Blessing","I have entered the valley of blessing so sweet",i_have_entered_the_valley_of_blessing_so,GH161894,104,"The Valley of Blessing","Oh, come to this valley of blessing so sweet","Mrs. Annie Wittenmeyer","Wm. G. Fischer",,"[I have entered the valley of blessing so sweet]",i_have_entered_the_valley_fischer,513212165121135,English,,
"Gospel Melodies: a New Collection of Gospel Hymns and Songs","O come to the valley of blessing so sweet","I have entered the valley of blessing so sweet",i_have_entered_the_valley_of_blessing_so,GMNC1890,d67,,"O come to the valley of blessing so sweet","Annie Wittenmeyer",,,,,,English,,
"Great Revival Hymns No. 2","The Valley of Blessing","I have entered the valley of blessing so sweet",i_have_entered_the_valley_of_blessing_so,GRH21913,61,"The Valley of Blessing","O come to this valley of blessing so sweet","Mrs. Annie Wittenmyer","Wm. G. Fischer",,"[I have entered the valley of blessing so sweet]",i_have_entered_the_valley_fischer,513212165121135,English,,
"Hallowed Songs","O come to this valley of blessing so sweet","I have entered the valley of blessing so sweet",i_have_entered_the_valley_of_blessing_so,HS1874,d151,,"O come to this valley of blessing so sweet","Annie Wittenmeyer",,,,,,English,,
"Hallowed Songs: for prayer and social meetings, containing hymns and tunes, carefully selected from all sources, both old and new, and are of the most spiritual..(Newly Revised)","Oh, come to this valley of blessing so sweet","I have entered the valley of blessing so sweet",i_have_entered_the_valley_of_blessing_so,HS1870,109,,"Oh, come to this valley of blessing so sweet","Annie Wittenmeyer",,,,,,English,,
"Hymns of Consecration and Faith","I Have Entered the Valley","I have enter'd the valley of blessing so sweet",i_have_entered_the_valley_of_blessing_so,HCF1902,204,"I Have Entered the Valley","Oh, come to this valley of blessing so sweet","A. Wittenmyer","W. G. Fischer",,"[I have enter'd the valley of blessing so sweet]",i_have_entered_the_valley_fischer,513212165121135,English,,
"Hymns of the Christian Life: for the sanctuary, Sunday schools, prayer meetings, mission work and revival services","I Have Entered the Valley of Blessing So Sweet","I have entered the valley of blessing so sweet",i_have_entered_the_valley_of_blessing_so,HCL1891,420,"I Have Entered the Valley of Blessing So Sweet","Oh, come to this valley of blessing so sweet","Mrs. Annie Wittenmeyer",,,,,,English,,
"Hymns of the Millennial Dawn","O come to this valley of blessing so sweet","I have entered the valley of blessing so sweet",i_have_entered_the_valley_of_blessing_so,HoMD1937,ad100,,"O come to this valley of blessing so sweet","Annie Wittenmeyer",,,,,,English,,
"Hymns of the Millennial Dawn, with Music: a Choice Collection of Psalms and Hymns and Spiritual Songs","O come to this valley of blessing so sweet","I have entered the valley of blessing so sweet",i_have_entered_the_valley_of_blessing_so,HMDM1921,d100,,"O come to this valley of blessing so sweet","Annie Wittenmeyer",,,,,,English,,
"Laudes Domini: a selection of spiritual songs, ancient and modern for use in the prayer-meeting","Oh, come to this valley of blessing so sweet","I have entered the valley of blessing so sweet",i_have_entered_the_valley_of_blessing_so,LD1890,306,,"Oh, come to this valley of blessing so sweet","Mrs. A. Wittenmyer","W. G. Fischer",,"VALLEY OF BLESSING",i_have_entered_the_valley_fischer,513212165121135,English,,
"Loving Voices: for Sunday-school, church and home circle","Valley of Blessing","I have entered the valley of blessing so sweet",i_have_entered_the_valley_of_blessing_so,LVSS1887,146,"Valley of Blessing","Oh, come to this valley of blessing so sweet","Annie Wittenmeyer","Wm. G. Fischer",,"[I have entered the valley of blessing so sweet]",i_have_entered_the_valley_fischer,513212165121135,English,,
"New Spiritual Songs","O, come to this valley of blessing so sweet","I have entered the valley of blessing so sweet",i_have_entered_the_valley_of_blessing_so,NSS1887,212a,,"O, come to this valley of blessing so sweet",,,,,,,English,,
"Notes of Joy, for the Sabbath School","O come to this valley of blessing so sweet","I have entered the valley of blessing so sweet",i_have_entered_the_valley_of_blessing_so,NJSS1869,d51,,"O come to this valley of blessing so sweet","Annie Wittenmeyer",,,,,,,,
"Poems and Hymns of Dawn","Valley of Blessing","I have entered the valley of blessing so sweet",i_have_entered_the_valley_of_blessing_so,PHoD1890,107,"Valley of Blessing","There's joy in the valley of blessing so sweet",,,,,,,English,,
"Prayer and Praise: or Hymns and Tunes for Prayer Meetings, Praise Meetings, Experience Meetings, Revivals, Missionary Meetings and all special occasions of Christian work and worship","The Valley of Blessing","I have entered the valley of blessing so sweet",i_have_entered_the_valley_of_blessing_so,PP1883,160,"The Valley of Blessing","Oh, come to this valley of blessing so sweet","Annie Wittenmeyer","Wm. G. Fischer",,"[I have entered the valley of blessing so sweet]",i_have_entered_the_valley_fischer,513212165121135,English,,
"Psalms and Hymns and Spiritual Songs: a manual of worship for the church of Christ","Oh, come to this valley of blessing so sweet","I have entered the valley of blessing so sweet",i_have_entered_the_valley_of_blessing_so,PHSS1875,922,,"Oh, come to this valley of blessing so sweet","Mrs. Wittemeyer",,,"VALLYE OF BLESSING",i_have_entered_the_valley_fischer,513212165121135,,,
"Redemption Songs: a choice collection of 1000 hymns and choruses for evangelistic meetings, solo singers, choirs and the home","The Valley of Blessing","I have enter'd the valley of blessing so sweet",i_have_entered_the_valley_of_blessing_so,RS1900,382,"The Valley of Blessing","O come to this valley of blessing so sweet","A. Wittenmeyer","W. G. Fischer",,"[I have enter'd the valley of blessing so sweet]",i_have_entered_the_valley_fischer,513212165121135,English,,
"Rescue Songs: words and music with standard selections","Valley of Blessing","I have entered the valley of blessing so sweet",i_have_entered_the_valley_of_blessing_so,RSWM1890,17,"Valley of Blessing","Oh come to this valley of blessing so sweet","Mrs. Annie Wittenmeyer","W. G. Fischer",,"[I have entered the valley of blessing so sweet]",i_have_entered_the_valley_fischer,513212165121135,English,,
"Revival Hymns","O come to this valley of blessing so sweet","I have entered the valley of blessing so sweet",i_have_entered_the_valley_of_blessing_so,RH1876,d27,,"O come to this valley of blessing so sweet","Annie Wittenmeyer",,,,,,,,
"Revival Hymns (Rev. ed.)","Oh come to this valley of blessing so sweet","I have enter'd the valley of blessing so sweet",i_have_entered_the_valley_of_blessing_so,RHR1873,115,,"Oh come to this valley of blessing so sweet",,,,,,,,,
"Sacred Melodies (Revised)","O come to this valley of blessing so sweet","I have entered the valley of blessing so sweet",i_have_entered_the_valley_of_blessing_so,SMR1889,d118,,"O come to this valley of blessing so sweet","Annie Wittenmeyer",,,,,,,,
"Sacred Melodies Nos.1 and 2 combined: As used by Evangelist H. W. Brown and others, in Gospel Meetings and other religious services","The Valley of Blessing","I have entered the valley of blessing so sweet",i_have_entered_the_valley_of_blessing_so,SMN11886,18,"The Valley of Blessing","Oh come to this valley of blessing so sweet","Mrs. Annie Wittenmeyer","Wm. G. Fischer",,"[I have entered the valley of blessing so sweet]",i_have_entered_the_valley_fischer,513212165121135,English,,
"Sacred Songs & Solos: Nos 1. and 2. Combined","The Valley of Blessing","I have entered the valley of blessing so sweet",i_have_entered_the_valley_of_blessing_so,SSSC1880,50,"The Valley of Blessing","Oh, come to this valley of blessing so sweet",,,,"[I have entered the valley of blessing so sweet]",i_have_entered_the_valley_fischer,513212165121135,English,,
"Sacred Songs and Solos: with standard hymns, combined: 750 pieces","The Valley of Blessing","I have entered the valley of blessing so sweet",i_have_entered_the_valley_of_blessing_so,SSAS1890,50,"The Valley of Blessing","Oh, come to this valley of blessing","A. Wittenmeyer","W. G. Fischer",,"[I have entered the valley of blessing so sweet]",i_have_entered_the_valley_fischer,513212165121135,English,,
"Sacred Songs for Church and Home","O come to this valley of blessing so sweet","I have entered the valley of blessing so sweet",i_have_entered_the_valley_of_blessing_so,SSCH1923,d194,,"O come to this valley of blessing so sweet","Annie Wittenmeyer",,,,,,English,,
"Salvation Army Music: (formerly published as ""Revival Music"") with supplementary tunes","The Valley of Blessing","I have enter'd the valley of blessing so sweet",i_have_entered_the_valley_of_blessing_so,SAM1880,83,"The Valley of Blessing",,,,,"[I have enter'd the valley of blessing so sweet]",i_have_entered_the_valley_fischer,513212165121135,English,,
"Select Songs for the Singing Service: in the Prayer Meeting and Sunday School","The Valley of Blessing","I have entered the valley of blessing so sweet",i_have_entered_the_valley_of_blessing_so,SSSS1885,63,"The Valley of Blessing","Oh, come to this valley of blessing so sweet","Mrs. Annie Wittenmeyer","Wm. G. Fischer",,"[I have entered the valley of blessing so sweet]",i_have_entered_the_valley_fischer,513212165121135,English,,
"Select Songs for the Sunday School","The Valley of Blessing","I have entered the valley of blessing so sweet",i_have_entered_the_valley_of_blessing_so,SSSS1884,63,"The Valley of Blessing","Oh, come to this valley of blessing so sweet","Mrs. Annie Wittenmeyer","Wm. G. Fischer",,"[I have entered the valley of blessing so sweet]",i_have_entered_the_valley_fischer,513212165121135,English,,
"Select Songs No. 2: for the singing service in the prayer meeting; Sunday school; Christian Endeavor meetings","Oh. come to the valley of blessing so sweet","I have entered the valley of blessing so sweet",i_have_entered_the_valley_of_blessing_so,SS21893,314,,"Oh. come to the valley of blessing so sweet","Annie Wittenmeyer",,,,,,English,,
"Songs for the Sanctuary: or hymns and tunes for Christian Worship","Oh, come to this valley of blessing so sweet","I have entered the valley of blessing so sweet",i_have_entered_the_valley_of_blessing_so,SSHT1872,481a,,"Oh, come to this valley of blessing so sweet",,,,,,,,,
"Songs for Worship: in the Sunday-school, social-meeting, and family","Oh, come to this valley of blessing so sweet","I have entered the valley of blessing so sweet",i_have_entered_the_valley_of_blessing_so,S4W1873,114a,,"Oh, come to this valley of blessing so sweet",,,,,,,,,
"Songs of Beulah Land, a Revival and Church Songbook","O come to this valley of blessing so sweet","I have entered the valley of blessing so sweet",i_have_entered_the_valley_of_blessing_so,SBLR1920,d39,,"O come to this valley of blessing so sweet","Annie Wittenmeyer",,,,,,English,,
"Songs of Calvary and Pentecost","O come to this valley of blessing so sweet","I have entered the valley of blessing so sweet",i_have_entered_the_valley_of_blessing_so,SoCP1896,d53,,"O come to this valley of blessing so sweet","Annie Wittenmeyer",,,,,,,,
"Songs of Gladness for the Sabbath School","The Valley of Blessing","I have entered the valley of blessing so sweet",i_have_entered_the_valley_of_blessing_so,SGSS1869,20,"The Valley of Blessing",,"Annie Wittenmeyer","Wm. G. Fischer",,"[I have entered the valley of blessing so sweet]",i_have_entered_the_valley_fischer,513212165121135,,,
"Songs of Glory No. 2: a collection of beautiful songs for Sunday Schools and the Family Circle","Valley of Blessing","I have entered the valley of blessing so sweet",i_have_entered_the_valley_of_blessing_so,SoG21881,82,"Valley of Blessing","Oh, come to this valley of blessing so sweet","Annie Wittenmeyer","Wm. G. Fischer",,"[I have entered the valley of blessing so sweet]",i_have_entered_the_valley_fischer,513212165121135,English,,
"Songs of Joy and Gladness","Oh come to this valley of blessing so sweet","I have entered the valley of blessing so sweet",i_have_entered_the_valley_of_blessing_so,SoJG1885,253,,"Oh come to this valley of blessing so sweet",,,,,,,English,,
"Songs of Joy and Gladness with Supplement","Oh come to this valley of blessing so sweet","I have entered the valley of blessing so sweet",i_have_entered_the_valley_of_blessing_so,SJGS1889,253,,"Oh come to this valley of blessing so sweet",,,,,,,English,,
"Songs of Redemption","I Have Entered the Valley","I have entered the valley of blessing so sweet",i_have_entered_the_valley_of_blessing_so,SoR1899,160,"I Have Entered the Valley","O come to this valley of blessing so sweet",,,,,,,English,,
"Songs of Victory","Valley of Blessing","I have entered the valley of blessing so sweet",i_have_entered_the_valley_of_blessing_so,SoV1889,77,"Valley of Blessing","Oh, come to this valley of blessing so sweet","Mrs. Annie Wittenmeyer","W. G. Fischer",,"[I have entered the valley of blessing so sweet]",i_have_entered_the_valley_fischer,513212165121135,English,,
"Songs of Victory: for evangelistic meetings, conferences, the home circle, and Christian worship. Along with a selection of choruses","The Valley of Blessing","I have entered the valley of blessing so sweet",i_have_entered_the_valley_of_blessing_so,SoV1890,490,"The Valley of Blessing","Oh, come to this valley of blessing so sweet",,,,"[I have entered the valley of blessing so sweet]",i_have_entered_the_valley_fischer,513212165121135,English,,
"Sought-Out Songs for Christian Workers","O come to this valley of blessing so sweet","I have entered the valley of blessing so sweet",i_have_entered_the_valley_of_blessing_so,SOSC1888,d50,,"O come to this valley of blessing so sweet","Annie Wittenmeyer",,,,,,,,
"Sought-Out Songs for Christian Workers","O come to this valley of blessing so sweet","I have entered the valley of blessing so sweet",i_have_entered_the_valley_of_blessing_so,SOSC1889,d51,,"O come to this valley of blessing so sweet","Annie Wittenmeyer",,,,,,,,
"Soul Winning Songs","Valley of Blessing","I have entered the valley of blessing so sweet",i_have_entered_the_valley_of_blessing_so,SS1898,194,"Valley of Blessing","Oh come to this valley of blessing so sweet","Mrs. Annie Wittenmeyer","W. G. Fisher",,"[I have entered the valley of blessing so sweet]",i_have_entered_the_valley_fischer,513212165121135,English,,
"Sparkling Jewels for the Sunday School: a new collection of choice music","Oh, come to this valley of blessing so sweet","I have entered the valley of blessing so sweet",i_have_entered_the_valley_of_blessing_so,SJSS1871,41,,"Oh, come to this valley of blessing so sweet","Annie Wittenmeyer",,,,,,,,
"Spiritual Songs for Gospel Meetings and the Sunday School","O, come to this valley of blessing so sweet","I have entered the valley of blessing so sweet",i_have_entered_the_valley_of_blessing_so,SSGM1878,100a,,"O, come to this valley of blessing so sweet",,,,,,,English,,
"Sunday School Hymns. New and improved ed.","O come to this valley of blessing so sweet","I have entered the valley of blessing so sweet",i_have_entered_the_valley_of_blessing_so,SSHN1871,d27,,"O come to this valley of blessing so sweet","Annie Wittenmeyer",,,,,,,,
"Temple Chimes","O come to this valley of blessing so sweet","I have entered the valley of blessing so sweet",i_have_entered_the_valley_of_blessing_so,TC1888,d110,,"O come to this valley of blessing so sweet","Annie Wittenmeyer",,,,,,,,
"The Aid to Praise","O come to this valley of blessing so sweet","I have entered the valley of blessing so sweet",i_have_entered_the_valley_of_blessing_so,AP1875,27,,"O come to this valley of blessing so sweet","Annie Wittenmeyer",,,,,,,,
"The Amaranth","I have entered the valley of blessing so sweet","I have entered the valley of blessing so sweet",i_have_entered_the_valley_of_blessing_so,A1871,d66,,,"Annie Wittenmeyer",,,,,,,,
"The Casket of Sunday School Melodies, Complete. Compiled from Caskets Nos.1 and 2 with Several Additional Pieces","O come to this valley of blessing so sweet","I have entered the valley of blessing so sweet",i_have_entered_the_valley_of_blessing_so,CSSM1869,d63,,"O come to this valley of blessing so sweet","Annie Wittenmeyer",,,,,,,,