displayTitle,firstLine,textAuthNumber,hymnalTitle,hymnalID,number,textTitle,refrainFirstLine,authors,composers,meter,tuneTitle,tuneAuthNumber,incipit,languages,textSources,tuneSources
"Peace Is Flowing Like a River","Peace is flowing like a river",peace_is_flowing_like_a_river,"Worship in Song: A Friends Hymnal",WinS1996,318,"Peace Is Flowing Like a River",,,,,"[Peace is flowing like a river]",peace_is_flowing_like_a_river_32151,321512312175123,,Traditional,Traditional
"Peace Is Flowing like a River","Peace is flowing like a river",peace_is_flowing_like_a_river,"Breaking Bread (Vol. 39)",BB2020,527,"Peace Is Flowing like a River",,"Carey Landry","Carey Landry",,"[Peace is flowing like a river]",peace_is_flowing_like_a_river_32151,321512312175123,English,,Traditional
"Peace is flowing like a river","Peace is flowing like a river",peace_is_flowing_like_a_river,"Complete Anglican Hymns Old and New",CAH2000,553a,"Peace is flowing like a river",,Unknown,"Unknown; Andrew Moore",,"[Peace is flowing like a river]",peace_is_flowing_like_a_river_32151,321512312175123,English,"V. 5: the editors",
"Peace is flowing like a river","Peace is flowing like a river",peace_is_flowing_like_a_river,"Complete Anglican Hymns Old and New",CAH2000,553b,"Peace is flowing like a river","Let it flow through me",Unknown,Unknown,,"[Peace is flowing like a river]",peace_is_flowing_like_a_river_32151,321512312175123,English,"V. 5: the editors",
"Peace Is Flowing like a River","Peace is flowing like a river",peace_is_flowing_like_a_river,"Glory and Praise (3rd. ed.)",GAP2015,675,"Peace Is Flowing like a River",,"Carey Landry, b. 1944","Carey Landry; Louise Anderson, b. 1944",,"[Peace is flowing like a river]",peace_is_flowing_like_a_river_32151,321512312175123,English,Traditional,
"Peace Is Flowing Like a River","Peace is flowing like a river",peace_is_flowing_like_a_river,"Gather Comprehensive",GC1994,728,"Peace Is Flowing Like a River",,Unknown,"Diana Kodner, b. 1957; Unknown",,"[Peace is flowing like a river]",peace_is_flowing_like_a_river_32151,321512312175123,English,,
"Peace Is Flowing like a River","Peace is flowing like a river",peace_is_flowing_like_a_river,"Journeysongs (3rd ed.)",JS2012,706,"Peace Is Flowing like a River",,"Carey Landry, b. 1944","Carey Landry; Louise Anderson, b. 1944",,"[Peace is flowing like a river]",peace_is_flowing_like_a_river_32151,321512312175123,English,Traditional,Traditional
"Peace Is Flowing like a River","Peace is flowing like a river",peace_is_flowing_like_a_river,"Journeysongs (2nd ed.)",JS2003,745,"Peace Is Flowing like a River",,"Carey Landry, b. 1944","Carey Landry",,"[Peace is flowing like a river]",peace_is_flowing_like_a_river_32151,321512312175123,English,Traditional,
"Peace Is Flowing","Peace is flowing like a river",peace_is_flowing_like_a_river,"One in Faith",OIF2014,796,"Peace Is Flowing",,,,,"[Peace is flowing like a river]",peace_is_flowing_like_a_river_32151,321512312175123,English,,Traditional
"Peace is flowing like a river","Peace is flowing like a river",peace_is_flowing_like_a_river,"Complete Mission Praise",CMP2000,554,"Peace is flowing like a river",,Anon,"Anon; Betty Pulkingham",,"[Peace is flowing like a river]",peace_is_flowing_like_a_river_32151,321512312175123,English,,
"Peace Is Flowing Like a River","Peace is flowing like a river",peace_is_flowing_like_a_river,"Gather Comprehensive, Second Edition",GC2,725,"Peace Is Flowing Like a River",,Unknown,"Unknown; Diana Kodner, b. 1957",,"[Peace is flowing like a river]",peace_is_flowing_like_a_river_32151,321512312175123,English,,
"Peace Is Flowing Like a River","Peace is flowing like a river",peace_is_flowing_like_a_river,"Gather (3rd ed.)",G32011,819,"Peace Is Flowing Like a River",,Anonymous,"Anonymous; Diana Kodner, b. 1957",,"[Peace is flowing like a river]",peace_is_flowing_like_a_river_32151,321512312175123,English,,
"Peace is flowing like a river","Peace is flowing like a river",peace_is_flowing_like_a_river,"Anglican Hymns Old and New (Rev. and Enl.)",HON2008,613a,,,,Unknown,,"[Peace is flowing like a river]",peace_is_flowing_like_a_river_32151,321512312175123,English,"Various authors",
"Peace is flowing like a river","Peace is flowing like a river",peace_is_flowing_like_a_river,"Anglican Hymns Old and New (Rev. and Enl.)",HON2008,613b,,,,Unknown,,"[Peace is flowing like a river]",peace_is_flowing_like_a_river_32151,321512312175123,English,"Various authors",
"Peace is flowing like a river","Peace is flowing like a river",peace_is_flowing_like_a_river,"Small Church Music",SCM,4234,,,,,8.7.8.7,"[Peace is flowing like a river] (Anonymous)",peace_is_flowing_like_a_river_32151,321512312175123,,,
