displayTitle,firstLine,textAuthNumber,hymnalTitle,hymnalID,number,textTitle,refrainFirstLine,authors,composers,meter,tuneTitle,tuneAuthNumber,incipit,languages,textSources,tuneSources
"In all my ways, O God!","In all my ways, O God!",in_all_my_ways_o_god,"The Christian hymnal: a collection of hymns and tunes for congregational and social worship; in two parts (Rev.)",CHR1882,415,,,Unknown,,6.6.8.6,,,,English,,
"In all my ways, O God","In all my ways, O God",in_all_my_ways_o_god,"Psalms and Hymns, for Christian Use and Worship",PHCU1845,H655,,,,,,,,,,,
"In all my ways, O God!","In all my ways, O God!",in_all_my_ways_o_god,"Psalms, Hymns, and Spiritual Songs: original and selected (5th ed.)",PHSS1847,B73,,,,,,,,,,,
"In all my ways, O God","In all my ways, O God",in_all_my_ways_o_god,"The Baptist Harp: a new collection of hymns for the closet, the family, social worship, and revivals",BH1849,51,,,Montgomery,,,,,,,,
"In all my [our] [thy] ways, O God [Lord] I would acknowledge thee","In all my [our] [thy] ways, O God [Lord] I would acknowledge thee",in_all_my_ways_o_god,"Psalms, Hymns and Spiritual Songs, Original and Selected. (14th stereotype ed.)",PHSS1850,73,,,"Benjamin Beddome",,,,,,,,
"In all my [our] [thy] ways, O God [Lord] I would acknowledge thee","In all my [our] [thy] ways, O God [Lord] I would acknowledge thee",in_all_my_ways_o_god,"Resurrected Songs prepared for the Church",RS4C1904,d102,,,"Benjamin Beddome",,,,,,,,
"In all my [our] [thy] ways, O God [Lord] I would acknowledge thee","In all my [our] [thy] ways, O God [Lord] I would acknowledge thee",in_all_my_ways_o_god,"Zion's Harp ... Sacred Songs Not Found in the Methodist Hymn Book and Many Never Before Published with Several Original Pieces",ZHSS1852,d162,,,"Benjamin Beddome",,,,,,,,
"In all my [our] [thy] ways, O God [Lord] I would acknowledge thee","In all my [our] [thy] ways, O God [Lord] I would acknowledge thee",in_all_my_ways_o_god,"The Christian Melodist, a Collection of  Popular Songs, for Use in Public and Social Meetings ...",CMCP1850,d175,,,"Benjamin Beddome",,,,,,,,
"In all my [our] [thy] ways, O God [Lord] I would acknowledge thee","In all my [our] [thy] ways, O God [Lord] I would acknowledge thee",in_all_my_ways_o_god,"The South Western Psalmist",SWP1852,d188,,,"Benjamin Beddome",,,,,,,,
"In all my [our] [thy] ways, O God [Lord] I would acknowledge thee","In all my [our] [thy] ways, O God [Lord] I would acknowledge thee",in_all_my_ways_o_god,"The Christian Psalmist (Numeral ed.) 10th ed., 1st rev. ed.",CPN11851,d195,,,"Benjamin Beddome",,,,,,,,
"In all my [our] [thy] ways, O God [Lord] I would acknowledge thee","In all my [our] [thy] ways, O God [Lord] I would acknowledge thee",in_all_my_ways_o_god,"The Vestry Hymn Book",VHB1858,d216,,,"Benjamin Beddome",,,,,,,,
"In all my [our] [thy] ways, O God [Lord] I would acknowledge thee","In all my [our] [thy] ways, O God [Lord] I would acknowledge thee",in_all_my_ways_o_god,"Select Hymns",SH1854,d217,,,"Benjamin Beddome",,,,,,,,
"In all my ways, O God","In all my ways, O God",in_all_my_ways_o_god,"Dyer's Psalmist: A Collection of Hymns and Sacred Songs for the use of Baptist Churches (Rev. & Corrd. ed.) ",DP1853,228,,,Montgomery,,,,,,English,,
"In all my [our] [thy] ways, O God [Lord] I would acknowledge thee","In all my [our] [thy] ways, O God [Lord] I would acknowledge thee",in_all_my_ways_o_god,"Chapel Hymns",CH1846,d259,,,"Benjamin Beddome",,,,,,English,,
"In all my [our] [thy] ways, O God [Lord] I would acknowledge thee","In all my [our] [thy] ways, O God [Lord] I would acknowledge thee",in_all_my_ways_o_god,"A Selection of Hymns, adapted to the devotions of the closet, the family, and the social circle; and containing subjects appropriate to the monthly concerns of prayer for the success...",SHAD1831,292,,,"Benjamin Beddome",,,,,,English,,
"In all my [our] [thy] ways, O God [Lord] I would acknowledge thee","In all my [our] [thy] ways, O God [Lord] I would acknowledge thee",in_all_my_ways_o_god,"The Christian Hymnal",CH1871,d329,,,"Benjamin Beddome",,,,,,,,
"In all my [our] [thy] ways, O God [Lord] I would acknowledge thee","In all my [our] [thy] ways, O God [Lord] I would acknowledge thee",in_all_my_ways_o_god,"The Christian Psalmist",CP1854,d330,,,"Benjamin Beddome",,,,,,,,
"In all my ways, O God","In all my ways, O God",in_all_my_ways_o_god,"New Christian Hymn and Tune Book",NCHT1882,371,,,Unknown,,,,,,English,,
"In all my ways, O God","In all my ways, O God",in_all_my_ways_o_god,"New Christian Hymn and Tune Book",NCHT1887,371,,,Unknown,,,,,,English,,
"In all my ways, O God","In all my ways, O God",in_all_my_ways_o_god,"A Selection of Hymns: designed as a supplement to the ""psalms and hymns"" of the Presbyterian church",SHDS1861,385,,,,,,,,,English,,
"In all my ways, O God","In all my ways, O God",in_all_my_ways_o_god,"A Selection of Hymns for the Use of Social Religious Meetings and for Private Devotions. 7th ed.",SHUS1833,418,,,,,,,,,English,,
"In all my ways, O God","In all my ways, O God",in_all_my_ways_o_god,"The New Congregational Hymn and Tune Book, for Public, Social and Private  Worship",NCHT1859,445,,,Beddome,,,,,,,,
"In all my [our] [thy] ways, O God [Lord] I would acknowledge thee","In all my [our] [thy] ways, O God [Lord] I would acknowledge thee",in_all_my_ways_o_god,"Songs of Pilgrimage: a hymnal for the churches of Christ (2nd ed.)",SoP1886,562,,,"Benjamin Beddome",,,,,,,,
"In all my ways, O God!","In all my ways, O God!",in_all_my_ways_o_god,"The Christian Hymnal: a choice collection of hymns and tunes for congregational and social worship",CHCC1875,607,,,,,,,,,,,
"In all my ways, O God! ","In all my ways, O God! ",in_all_my_ways_o_god,"Christian Hymn and Tune Book, for use in Churches, and for Social and Family Devotions",CHTB1870,740,,,,,,,,,English,,
"In all my [our] [thy] ways, O God [Lord] I would acknowledge thee","In all my [our] [thy] ways, O God [Lord] I would acknowledge thee",in_all_my_ways_o_god,"Congregational Hymn and Tune Book; containing the Psalms and Hymns of the General Association of Connecticut, adapted to Suitable Tunes",CHTB1856,842,,,"Benjamin Beddome",,,,,,English,,
"In all my ways, O God","In all my ways, O God",in_all_my_ways_o_god,"The Congregational Hymn Book: for the service of the sanctuary",CHBS1857,882,,,Beddome,,,,,,,,
"In all my [our] [thy] ways, O God [Lord] I would acknowledge thee","In all my [our] [thy] ways, O God [Lord] I would acknowledge thee",in_all_my_ways_o_god,"The Baptist Psalmody: a selection of hymns for the worship of God",BP1850,1146,,,"Benjamin Beddome",,,,,,,,
"In all my ways, O God!","In all my ways, O God!",in_all_my_ways_o_god,"The Christian Hymn Book: a compilation of psalms, hymns and spiritual songs, original and selected (Rev. and enl.)",CHB1865,1173,,,,,,,,,,,
"In all my ways, O God ","In all my ways, O God ",in_all_my_ways_o_god,"The Baptist Hymn and Tune Book: being ""The Plymouth Collection"" enlarged and adapted to the use of Baptist churches",BHTB1868,1495,,,,,,,,,,,
"In all our ways, O God","In all our ways, O God",in_all_my_ways_o_god,"Hymns of Worship: designed for use especially in the lecture room, the prayer meeting and the family",HWDU1858,264,,,,,,,,,English,,
"In all my ways, O Lord","In all my ways, O Lord",in_all_my_ways_o_god,"Select Hymns: adapted to the devotional exercises of the Baptist denomination (2nd ed.)",SHAD1836,382,,,Montgomery,,,,,,,,
"In all thy ways, O God","In all thy ways, O God",in_all_my_ways_o_god,"A Collection of Psalms, Hymns and Spiritual Songs; suited to the various kinds of Christian worship; and especially designed for and adapted to the Fraternity of the Brethren...",CPHS1867,720,,,,,,,,,English,,
