displayTitle,firstLine,textAuthNumber,hymnalTitle,hymnalID,number,textTitle,refrainFirstLine,authors,composers,meter,tuneTitle,tuneAuthNumber,incipit,languages,textSources,tuneSources
"Behold us, Lord! with humble fear","Behold us, Lord! with humble fear",behold_us_lord_with_humble_fear,"Hymn Book for Christian Worship. 8th ed.",HBCW1864,a18,,,,,,,,,English,"Pratt's Col.",
"Behold us, Lord, with humble fear","Behold us, Lord, with humble fear",behold_us_lord_with_humble_fear,"Church Psalmody: a Collection of Psalms and Hymns adapted to public worship",CPCP1831,P5.4,,,,,,,,,English,,
"Behold us, Lord, with humble fear","Behold us, Lord, with humble fear",behold_us_lord_with_humble_fear,"Church Psalmody: a Collection of Psalms and Hymns Adapted to Public Worship",CPCP1843,P5d,,,,,,,,,English,,
"Behold us, Lord, with humble fear","Behold us, Lord, with humble fear",behold_us_lord_with_humble_fear,"Psalms and Hymns: adapted to social, private and public worship in the Cumberland Presbyterian Chruch",PHAS1859,P5d,,,"Charles Wesley, 1707-1788",,,,,,,,
"Behold us, Lord, with humble fear","Behold us, Lord, with humble fear",behold_us_lord_with_humble_fear,"Manual of Christian Psalmody: a collection of psalms and hymns for public worship",MoCP1832,P5d,,,,,,,,,English,,
"Behold us, Lord, with humble fear","Behold us, Lord, with humble fear",behold_us_lord_with_humble_fear,"Worship in the School Room: a manual of devotion intended especially for the school, also adapted to the family",WSR1867,7,,,Unknown,,,EVAN,evan_havergal,55132165551312432,,,
"Behold us, Lord, with humble fear","Behold us, Lord, with humble fear",behold_us_lord_with_humble_fear,"A Selection of Hymns: designed as a supplement to the ""psalms and hymns"" of the Presbyterian church",SHDS1861,16,,,,,,,,,English,,
"Behold us, Lord! with humble fear","Behold us, Lord! with humble fear",behold_us_lord_with_humble_fear,"Hymn Book for Christian Worship",HBCW1854,18,,,,,,,,,English,"Pratt's Col.",
"Behold us, Lord, with humble fear","Behold us, Lord, with humble fear",behold_us_lord_with_humble_fear,"The Bay State Collection of Church Music",BSCC1849,d20,,,"Charles Wesley, 1707-1788",,,,,,,,
"Behold us, Lord, with humble fear","Behold us, Lord, with humble fear",behold_us_lord_with_humble_fear,"Cantica Laudis: or, the American Book of Church Music",CLAB1850,d30,,,"Charles Wesley, 1707-1788",,,,,,English,,
"Behold us, Lord, with humble fear","Behold us, Lord, with humble fear",behold_us_lord_with_humble_fear,"The Chapel Hymn Book.  5th ed.",CHB51845,d51,,,"Charles Wesley, 1707-1788",,,,,,,,
"Behold us, Lord, with humble fear","Behold us, Lord, with humble fear",behold_us_lord_with_humble_fear,"The Chapel Hymn Book (4th ed.)",CHBW1842,d53,,,"Charles Wesley, 1707-1788",,,,,,,,
"Behold us, Lord, with humble fear","Behold us, Lord, with humble fear",behold_us_lord_with_humble_fear,"Compilation of Hymns for the Use of the Churches of the Christian Union",CHUC1871,d78,,,"Charles Wesley, 1707-1788",,,,,,English,,
"Behold us, Lord, with humble fear","Behold us, Lord, with humble fear",behold_us_lord_with_humble_fear,"Melodies of the Church: a collection of psalms and hymns adapted to publick and social worship, seasons of revival, monthly concerts of prayer, and various similar occasions...",MoC1832,d111,,,"Charles Wesley, 1707-1788",,,,,,English,,
"Behold us, Lord, with humble fear","Behold us, Lord, with humble fear",behold_us_lord_with_humble_fear,"Church Melodies, a Collection of Psalms, Hymns and Spiritual Songs",CMCP1833,d114,,,"Charles Wesley, 1707-1788",,,,,,English,,
"Behold us, Lord, with humble fear","Behold us, Lord, with humble fear",behold_us_lord_with_humble_fear,"Hymn Book of the Methodist Protestant Church. (2nd ed.)",HBMP1838,354,,,,,,,,,English,,
"Behold us, Lord, with humble fear","Behold us, Lord, with humble fear",behold_us_lord_with_humble_fear,"Hymn book of the Methodist Protestant Church. (4th ed.)",HMPC1860,354,,,"Charles Wesley, 1707-1788",,,,,,English,,
"Behold us, Lord, with humble fear","Behold us, Lord, with humble fear",behold_us_lord_with_humble_fear,"Hymn Book of the Methodist Protestant Church",HBMP1859,507,,,,,,,,,English,"Pratt's Col.",
"Behold us, Lord, with humble fear","Behold us, Lord, with humble fear",behold_us_lord_with_humble_fear,"Hymn Book of the Methodist Protestant Church. (11th ed.)",HBMP1854,507,,,,,,,,,English,"Pratt's Col.",
