displayTitle,firstLine,textAuthNumber,hymnalTitle,hymnalID,number,textTitle,refrainFirstLine,authors,composers,meter,tuneTitle,tuneAuthNumber,incipit,languages,textSources,tuneSources
"Abermal ein Tag [Nacht] [Jahr] verflossen","Abermal ein Tag [Nacht] [Jahr] verflossen",abermal_ein_jahr_verflossen,"Das kleine Davidische Psalterspiel der Kinder Zions. 2. verb. aufl.",DDP1797,aa1,,,"Joachim Neander",,,,,,German,,
"Ach Jesu, mein Schoenster, erquicke mich Armen","Ach Jesu, mein Schoenster, erquicke mich Armen",ach_jesu_mein_schoenster_erquicke_mich_a,"Das kleine Davidische Psalterspiel der Kinder Zions. 2. verb. aufl.",DDP1797,aa10,,,,,,,,,German,,
"Diß ein das noth, Lehr mich","Diß ein das noth, Lehr mich",diss_ein_das_noth_lehr_mich,"Das kleine Davidische Psalterspiel der Kinder Zions. 2. verb. aufl.",DDP1797,aa100,,,,,,,,,German,,
"Du Geist, der alle Frommen fuehrt","Du Geist, der alle Frommen fuehrt",du_geist_der_alle_frommen_fuehrt,"Das kleine Davidische Psalterspiel der Kinder Zions. 2. verb. aufl.",DDP1797,aa101,,,,,,,,,German,,
"Du gruener Zweig, du edles Reis","Du gruener Zweig, du edles Reis",du_gruener_zweig_du_edles_reis,"Das kleine Davidische Psalterspiel der Kinder Zions. 2. verb. aufl.",DDP1797,aa102,,,"Johann Scheffler",,,,,,German,,
"Du Licht, das ohne Wechsel ist","Du Licht, das ohne Wechsel ist",du_licht_das_ohne_wechsel_ist,"Das kleine Davidische Psalterspiel der Kinder Zions. 2. verb. aufl.",DDP1797,aa103,,,,,,,,,German,,
"Du, meine Seele, singe Wohlauf","Du, meine Seele, singe Wohlauf",du_meine_seele_singe,"Das kleine Davidische Psalterspiel der Kinder Zions. 2. verb. aufl.",DDP1797,aa104,,,"Paul Gerhardt",,,,,,German,,
"Durch blosses Ged'chtnis dein, Jesu","Durch blosses Ged'chtnis dein, Jesu",durch_bloses_gedachniss_dein_jesu,"Das kleine Davidische Psalterspiel der Kinder Zions. 2. verb. aufl.",DDP1797,aa105,,,"Bernard of Clairvaux; Christian Knorr Rosenroth",,,,,,German,,
"Du schenkest mir dich selbst","Du schenkest mir dich selbst",du_schenkest_mir_dich_selbst,"Das kleine Davidische Psalterspiel der Kinder Zions. 2. verb. aufl.",DDP1797,aa106,,,"Gottfried Arnold",,,,,,German,,
"Du tausend-liebster Gott","Du tausend-liebster Gott",du_tausendliebster_gott,"Das kleine Davidische Psalterspiel der Kinder Zions. 2. verb. aufl.",DDP1797,aa107,,,,,,,,,German,,
"Du Tochter des Koenig's","Du Tochter des Koenig's",du_tochter_des_koenigs,"Das kleine Davidische Psalterspiel der Kinder Zions. 2. verb. aufl.",DDP1797,aa108,,,"Gottfried Arnold",,,,,,German,,
"Du unbegreiflich hoechstes Gut","Du unbegreiflich hoechstes Gut",du_unbegreiflich_hochstes_gut,"Das kleine Davidische Psalterspiel der Kinder Zions. 2. verb. aufl.",DDP1797,aa109,,,"Joachim Neander",,,,,,German,,
"Ach Jesu, schau hernieder","Ach Jesu, schau hernieder",ach_jesu_schau_hernieder,"Das kleine Davidische Psalterspiel der Kinder Zions. 2. verb. aufl.",DDP1797,aa11,,,,,,,,,German,,
"Du wesentliches Wort","Du wesentliches Wort",du_wesentliches_wort,"Das kleine Davidische Psalterspiel der Kinder Zions. 2. verb. aufl.",DDP1797,aa110,,,"Laurentius Laurenti",,,,,,German,,
"Ehre sei jetzo mit Freuden gesungen","Ehre sei jetzo mit Freuden gesungen",ehre_sei_jetzo_mit_freuden_gesungen,"Das kleine Davidische Psalterspiel der Kinder Zions. 2. verb. aufl.",DDP1797,aa111,,,"Joachim Neander",,,,,,German,,
"Eil doch heran, und mach dem Guten Bahn","Eil doch heran, und mach dem Guten Bahn",eil_doch_heran_und_mach_dem_guten_bahn,"Das kleine Davidische Psalterspiel der Kinder Zions. 2. verb. aufl.",DDP1797,aa112,,,,,,,,,German,,
"Ein Kind ist uns geboren heut', der liebste Sohn","Ein Kind ist uns geboren heut', der liebste Sohn",ein_kind_ist_uns_geboren_heut_der_liebst,"Das kleine Davidische Psalterspiel der Kinder Zions. 2. verb. aufl.",DDP1797,aa113,,,"Johann Anastasius Freylinghausen",,,,,,German,,
"Ein Koenig gross von Macht und Ehr","Ein Koenig gross von Macht und Ehr",ein_koenig_gross_von_macht_und_ehr,"Das kleine Davidische Psalterspiel der Kinder Zions. 2. verb. aufl.",DDP1797,aa114,,,,,,,,,German,,
"Ein's ist Not, ach Herr, dies eine Lehre","Ein's ist Not, ach Herr, dies eine Lehre",eins_ist_not_ach_herr_dies_eine,"Das kleine Davidische Psalterspiel der Kinder Zions. 2. verb. aufl.",DDP1797,aa115,,,,,,,,,German,,
"Ein troepflein von den Reben","Ein troepflein von den Reben",ein_tropflein_von_den_reben,"Das kleine Davidische Psalterspiel der Kinder Zions. 2. verb. aufl.",DDP1797,aa116,,,"Erasmus Fink",,,,,,German,,
"Entfernet euch, ihr matten Kr'fte","Entfernet euch, ihr matten Kr'fte",entfernet_euch_ihr_matten_krfte,"Das kleine Davidische Psalterspiel der Kinder Zions. 2. verb. aufl.",DDP1797,aa117,,,"Gottfried Arnold",,,,,,German,,
"Endlich wird es uns gelingen","Endlich wird es uns gelingen",endlich_wird_es_uns_gelingen,"Das kleine Davidische Psalterspiel der Kinder Zions. 2. verb. aufl.",DDP1797,aa118,,,,,,,,,German,,
"Erhebe dich, o meine Seel","Erhebe dich, o meine Seel",erhebe_dich_o_meine_seel,"Das kleine Davidische Psalterspiel der Kinder Zions. 2. verb. aufl.",DDP1797,aa119,,,"Peter Lackmann",,,,,,German,,
"Ach komm, Du suesser Herzens-Gast","Ach komm, Du suesser Herzens-Gast",ach_komm_du_suesser_herzensgast,"Das kleine Davidische Psalterspiel der Kinder Zions. 2. verb. aufl.",DDP1797,aa12,,,"Lueder Mencken",,,,,,German,,
"Erleucht mich, Herr, mein Licht","Erleucht mich, Herr, mein Licht",erleucht_mich_herr_mein_licht,"Das kleine Davidische Psalterspiel der Kinder Zions. 2. verb. aufl.",DDP1797,aa120,,,"E. W. Buchfelder",,,,,,German,,
"Ermuntert euch, ihr Frommen","Ermuntert euch, ihr Frommen",ermuntert_euch_ihr_frommen,"Das kleine Davidische Psalterspiel der Kinder Zions. 2. verb. aufl.",DDP1797,aa121,,,"Laurentius Laurenti",,,,,,German,,
"Erneure mich, o ewig's Licht, und lass","Erneure mich, o ewig's Licht, und lass",erneure_mich_o_ewges_licht_und_lass,"Das kleine Davidische Psalterspiel der Kinder Zions. 2. verb. aufl.",DDP1797,aa122,,,"J. F. Ruopp",,,,,,German,,
"Erstaunet all ihr Hoeh- und Tiefen","Erstaunet all ihr Hoeh- und Tiefen",erstaunet_all_ihr_hoeh_und_tiefen,"Das kleine Davidische Psalterspiel der Kinder Zions. 2. verb. aufl.",DDP1797,aa123,,,,,,,,,German,,
"Es gehet wohl,  Halleluja","Es gehet wohl,  Halleluja",es_gehet_wohl_halleluja,"Das kleine Davidische Psalterspiel der Kinder Zions. 2. verb. aufl.",DDP1797,aa124,,,,,,,,,German,,
"Es ging ein S'mann aus zu s'en","Es ging ein S'mann aus zu s'en",es_ging_ein_saemann_aus_zu_saen,"Das kleine Davidische Psalterspiel der Kinder Zions. 2. verb. aufl.",DDP1797,aa125,,,,,,,,,German,,
"Es gl'nzet der Christen inwendiges Leben","Es gl'nzet der Christen inwendiges Leben",es_glanzet_der_christen_inwendiges_leben,"Das kleine Davidische Psalterspiel der Kinder Zions. 2. verb. aufl.",DDP1797,aa126,,,"Christian Friedrich Richter",,,,,,German,,
"Es ist die letzte Stunde","Es ist die letzte Stunde",es_ist_die_letzte_stunde,"Das kleine Davidische Psalterspiel der Kinder Zions. 2. verb. aufl.",DDP1797,aa127,,,,,,,,,German,,
"Es ist gewisslich an der Zeit","Es ist gewisslich an der Zeit",es_ist_gewisslich_an_der_zeit,"Das kleine Davidische Psalterspiel der Kinder Zions. 2. verb. aufl.",DDP1797,aa128,,,"Bartholomaeus Ringwald",,,,,,German,,
"Es ist nicht schwer ein Christ zu sein","Es ist nicht schwer ein Christ zu sein",es_ist_nicht_schwer_ein_christ_zu_sein,"Das kleine Davidische Psalterspiel der Kinder Zions. 2. verb. aufl.",DDP1797,aa129,,,"Christian Friedrich Richter",,,,,,German,,
"Ach! lass Dich jetzt finden, Komm, Jesu, komm","Ach! lass Dich jetzt finden, Komm, Jesu, komm",ach_lass_dich_jetzt_finden,"Das kleine Davidische Psalterspiel der Kinder Zions. 2. verb. aufl.",DDP1797,aa13,,,,,,,,,German,,
"Es koste was es will","Es koste was es will",es_koste_was_es_will,"Das kleine Davidische Psalterspiel der Kinder Zions. 2. verb. aufl.",DDP1797,aa130,,,,,,,,,German,,
"Es kostet viel, ein Christ zu sein","Es kostet viel, ein Christ zu sein",es_kostet_viel_ein_christ_zu_sein,"Das kleine Davidische Psalterspiel der Kinder Zions. 2. verb. aufl.",DDP1797,aa131,,,"Christian Friedrich Richter",,,,,,German,,
"Es sei [sey] dem Schoepfer Dank gesagt","Es sei [sey] dem Schoepfer Dank gesagt",es_sei_sey_dem_schoepfer_dank_gesagt,"Das kleine Davidische Psalterspiel der Kinder Zions. 2. verb. aufl.",DDP1797,aa132,,,,,,,,,German,,
"Es sind schon die letzten Zeiten","Es sind schon die letzten Zeiten",es_sind_schon_die_letzten_zeiten,"Das kleine Davidische Psalterspiel der Kinder Zions. 2. verb. aufl.",DDP1797,aa133,,,"Laurentius Laurenti",,,,,,German,,
"Ew'ge Weisheit, Jesu Christ","Ew'ge Weisheit, Jesu Christ",ewge_weisheit_jesu_christ,"Das kleine Davidische Psalterspiel der Kinder Zions. 2. verb. aufl.",DDP1797,aa134,,,"Gottfried Arnold",,,,,,German,,
"Ei lobet doch alle Geschoepfe den Koenig","Ei lobet doch alle Geschoepfe den Koenig",ei_lobet_doch_alle_geschoepfe_den_koenig,"Das kleine Davidische Psalterspiel der Kinder Zions. 2. verb. aufl.",DDP1797,aa135,,,,,,,,,German,,
"Ei was frag ich nach der Erden","Ei was frag ich nach der Erden",ei_was_frag_ich_nach_der_erden,"Das kleine Davidische Psalterspiel der Kinder Zions. 2. verb. aufl.",DDP1797,aa136,,,"Joachim Neander",,,,,,German,,
"Fahre fort, Fahre fort, Zion","Fahre fort, Fahre fort, Zion",fahre_fort_fahre_fort,"Das kleine Davidische Psalterspiel der Kinder Zions. 2. verb. aufl.",DDP1797,aa137,,,"Johann Eusebius Schmidt",,,,,,German,,
"Fliehet aus Babel, ihr Kinder","Fliehet aus Babel, ihr Kinder",fliehet_aus_babel_ihr_kinder,"Das kleine Davidische Psalterspiel der Kinder Zions. 2. verb. aufl.",DDP1797,aa138,,,,,,,,,German,,
"Folget mir, ruft uns das Leben","Folget mir, ruft uns das Leben",folget_mir_ruft_uns_das_leben,"Das kleine Davidische Psalterspiel der Kinder Zions. 2. verb. aufl.",DDP1797,aa139,,,"Johann von Rist",,,,,,German,,
"Ach liebester Jesu, sieh auf mich","Ach liebester Jesu, sieh auf mich",ach_liebester_jesu_sieh_auf_mich,"Das kleine Davidische Psalterspiel der Kinder Zions. 2. verb. aufl.",DDP1797,aa14,,,,,,,,,German,,
"Fort, ihr Glieder und Gespielen","Fort, ihr Glieder und Gespielen",fort_ihr_glieder_und_gespielen,"Das kleine Davidische Psalterspiel der Kinder Zions. 2. verb. aufl.",DDP1797,aa140,,,,,,,,,German,,
"Frag deinen Gott, hoer, was er zeuget in seinem","Frag deinen Gott, hoer, was er zeuget in seinem",frag_deinen_gott_hoer_was,"Das kleine Davidische Psalterspiel der Kinder Zions. 2. verb. aufl.",DDP1797,aa141,,,"Gottfried Arnold",,,,,,German,,
"Friede, ach Friede, ach goettlicher Friede","Friede, ach Friede, ach goettlicher Friede",friede_ach_friede_ach_goettlicher_friede,"Das kleine Davidische Psalterspiel der Kinder Zions. 2. verb. aufl.",DDP1797,aa142,,,"Bartholomaeus Crasselius",,,,,,German,,
"Frisch, frisch hinnach, mein Geist und Herz","Frisch, frisch hinnach, mein Geist und Herz",frisch_frisch_hinnach_mein_geist_und_her,"Das kleine Davidische Psalterspiel der Kinder Zions. 2. verb. aufl.",DDP1797,aa143,,,"Wolfgang Christoph Dessler",,,,,,German,,
